Reaction Details
TargetTrypanothione reductase
LigandBDBM50178808
Substrate/Competitorn/a
Meas. Tech.ChEMBL_326414 (CHEMBL864478)
IC50 31600±n/a nM
Citation Parveen, SKhan, MOAustin, SECroft, SLYardley, VRock, PDouglas, KT Antitrypanosomal, antileishmanial, and antimalarial activities of quaternary arylalkylammonium 2-amino-4-chlorophenyl phenyl sulfides, a new class of trypanothione reductase inhibitor, and of N-acyl derivatives of 2-amino-4-chlorophenyl phenyl sulfide. J Med Chem48:8087-97 (2005) 
 
Trypanothione reductase
Name:Trypanothione reductase
Type:Homodimer; oxidoreductase
Mol. Mass.:53868.26
Organism:Trypanosoma cruzi
Description:n/a
Residue:492
BDBM50178808
NameBDBM50178808
Synonyms:CHEMBL372379 | N-(5-chloro-2-(phenylthio)phenyl)propionamide
TypeSmall organic molecule
Emp. Form.C15H14ClNOS
Mol. Mass.291.796
SMILESCCC(=O)Nc1cc(Cl)ccc1Sc1ccccc1