Reaction Details
TargetTrypanothione reductase
LigandBDBM50178810
Substrate/Competitorn/a
Meas. Tech.ChEMBL_326414 (CHEMBL864478)
IC50 30500±n/a nM
Citation Parveen, SKhan, MOAustin, SECroft, SLYardley, VRock, PDouglas, KT Antitrypanosomal, antileishmanial, and antimalarial activities of quaternary arylalkylammonium 2-amino-4-chlorophenyl phenyl sulfides, a new class of trypanothione reductase inhibitor, and of N-acyl derivatives of 2-amino-4-chlorophenyl phenyl sulfide. J Med Chem48:8087-97 (2005) 
 
Trypanothione reductase
Name:Trypanothione reductase
Type:Homodimer; oxidoreductase
Mol. Mass.:53868.26
Organism:Trypanosoma cruzi
Description:n/a
Residue:492
BDBM50178810
NameBDBM50178810
Synonyms:CHEMBL371088 | N-(5-chloro-2-(phenylthio)phenyl)butyramide
TypeSmall organic molecule
Emp. Form.C16H16ClNOS
Mol. Mass.305.822
SMILESCCCC(=O)Nc1cc(Cl)ccc1Sc1ccccc1