Reaction Details
TargetGag-Pol polyprotein [489-587]
LigandBDBM50178815
Substrate/Competitorn/a
Meas. Tech.ChEMBL_326376 (CHEMBL867569)
Ki 2.4±n/a nM
Citation Ekegren, JKUnge, TSafa, MZWallberg, HSamuelsson, BHallberg, A A new class of HIV-1 protease inhibitors containing a tertiary alcohol in the transition-state mimicking scaffold. J Med Chem48:8098-102 (2005) 
 
Gag-Pol polyprotein [489-587]
Name:Gag-Pol polyprotein [489-587]
Type:Enzyme Subunit
Mol. Mass.:10781.16
Organism:Human immunodeficiency virus type 1
Description:P04585[489-587]
Residue:99
BDBM50178815
NameBDBM50178815
Synonyms:((1S)-1-{N'-(4-Bromo-benzyl)-N'-[(2S)-2-hydroxy-2-((1S,2R)-2-hydroxy-indan-1-ylcarbamoyl)-3-phenyl-propyl]-hydrazinocarbonyl}-2,2-dimethyl-propyl)-carbamic acid methyl ester CHEMBL197500 {(1S)-1-[N'-(4-bromo-benzyl)-N'-[(2S)-2-hydroxy-2-((1S,2R)-2-hydroxy-indan-1-ylcarbamoyl)-3-phenyl-propyl]-hydrazinocarbonyl]-2,2-dimethyl-propyl}-carbamic acid methyl ester
TypeSmall organic molecule
Emp. Form.C34H41BrN4O6
Mol. Mass.681.617
SMILESCOC(=O)N[C@H](C(=O)NN(Cc1ccc(Br)cc1)C[C@@](O)(Cc1ccccc1)C(=O)N[C@@H]1[C@H](O)Cc2ccccc12)C(C)(C)C