Reaction Details
TargetSodium channel protein type 9 subunit alpha
LigandBDBM50164047
Substrate/Competitorn/a
Meas. Tech.ChEMBL_337839 (CHEMBL866524)
Ki 150±n/a nM
Citation Ok, DLi, CAbbadie, CFelix, JPFisher, MHGarcia, MLKaczorowski, GJLyons, KAMartin, WJPriest, BTSmith, MMWilliams, BSWyvratt, MJParsons, WH Synthesis and SAR of 1,2-trans-(1-hydroxy-3-phenylprop-1-yl)cyclopentane carboxamide derivatives, a new class of sodium channel blockers. Bioorg Med Chem Lett16:1358-61 (2006) 
 
Sodium channel protein type 9 subunit alpha
Name:Sodium channel protein type 9 subunit alpha
Type:Protein
Mol. Mass.:226375.97
Organism:Homo sapiens (Human)
Description:Q15858
Residue:1988
BDBM50164047
NameBDBM50164047
Synonyms:CHEMBL361097 N-[2,2']bithiophenyl-5-ylmethyl-N'-(2'-sulfamoyl-biphenyl-4-ylmethyl)-succinamide
TypeSmall organic molecule
Emp. Form.C26H25N3O4S3
Mol. Mass.539.689
SMILESNS(=O)(=O)c1ccccc1-c1ccc(CNC(=O)CCC(=O)NCc2ccc(s2)-c2cccs2)cc1