Reaction Details
TargetSodium channel protein type 9 subunit alpha
LigandBDBM50178866
Substrate/Competitorn/a
Meas. Tech.ChEMBL_337839 (CHEMBL866524)
Ki>3000±n/a nM
Citation Ok, DLi, CAbbadie, CFelix, JPFisher, MHGarcia, MLKaczorowski, GJLyons, KAMartin, WJPriest, BTSmith, MMWilliams, BSWyvratt, MJParsons, WH Synthesis and SAR of 1,2-trans-(1-hydroxy-3-phenylprop-1-yl)cyclopentane carboxamide derivatives, a new class of sodium channel blockers. Bioorg Med Chem Lett16:1358-61 (2006) 
 
Sodium channel protein type 9 subunit alpha
Name:Sodium channel protein type 9 subunit alpha
Type:Protein
Mol. Mass.:226375.97
Organism:Homo sapiens (Human)
Description:Q15858
Residue:1988
BDBM50178866
NameBDBM50178866
Synonyms:CHEMBL205207 | trans-N-benzyl-2-(1-hydroxy-3-phenylpropyl)cyclopentanecarboxamide
TypeSmall organic molecule
Emp. Form.C22H27NO2
Mol. Mass.337.4553
SMILESOC(CCc1ccccc1)[C@@H]1CCC[C@H]1C(=O)NCc1ccccc1