Reaction Details
TargetSodium channel protein type 9 subunit alpha
LigandBDBM50178859
Substrate/Competitorn/a
Meas. Tech.ChEMBL_337839 (CHEMBL866524)
Ki 320±n/a nM
Citation Ok, DLi, CAbbadie, CFelix, JPFisher, MHGarcia, MLKaczorowski, GJLyons, KAMartin, WJPriest, BTSmith, MMWilliams, BSWyvratt, MJParsons, WH Synthesis and SAR of 1,2-trans-(1-hydroxy-3-phenylprop-1-yl)cyclopentane carboxamide derivatives, a new class of sodium channel blockers. Bioorg Med Chem Lett16:1358-61 (2006) 
 
Sodium channel protein type 9 subunit alpha
Name:Sodium channel protein type 9 subunit alpha
Type:Protein
Mol. Mass.:226375.97
Organism:Homo sapiens (Human)
Description:Q15858
Residue:1988
BDBM50178859
NameBDBM50178859
Synonyms:CHEMBL205258 | trans-N-benzyl-2-(1-hydroxy-3-(2-(trifluoromethoxy)phenyl)propyl)cyclopentanecarboxamide
TypeSmall organic molecule
Emp. Form.C23H26F3NO3
Mol. Mass.421.4526
SMILESOC(CCc1ccccc1OC(F)(F)F)[C@@H]1CCC[C@H]1C(=O)NCc1ccccc1