Reaction Details
TargetDNA topoisomerase 4 subunit A
LigandBDBM50178920
Substrate/Competitorn/a
Meas. Tech.ChEMBL_340188 (CHEMBL864372)
IC50 7200±n/a nM
Citation Wiles, JAWang, QLucien, EHashimoto, ASong, YCheng, JMarlor, CWOu, YPodos, SDThanassi, JAThoma, CLDeshpande, MPucci, MJBradbury, BJ Isothiazoloquinolones containing functionalized aromatic hydrocarbons at the 7-position: synthesis and in vitro activity of a series of potent antibacterial agents with diminished cytotoxicity in human cells. Bioorg Med Chem Lett16:1272-6 (2006) 
 
DNA topoisomerase 4 subunit A
Name:DNA topoisomerase 4 subunit A
Type:PROTEIN
Mol. Mass.:91040.14
Organism:Staphylococcus aureus
Description:ChEMBL_340188
Residue:800
BDBM50178920
NameBDBM50178920
Synonyms:9-cyclopropyl-6-fluoro-7-(3-fluorophenyl)isothiazolo[5,4-b]quinoline-3,4(2H,9H)-dione | CHEMBL380696
TypeSmall organic molecule
Emp. Form.C19H12F2N2O2S
Mol. Mass.370.373
SMILESFc1cccc(c1)-c1cc2n(C3CC3)c3s[nH]c(=O)c3c(=O)c2cc1F