Reaction Details
TargetSodium-dependent serotonin transporter
LigandBDBM50178934
Substrate/Competitorn/a
Meas. Tech.ChEMBL_338547 (CHEMBL867191)
Ki 4.15±n/a nM
Citation Vercouillie, JMavel, SGalineau, LRagusa, TInnis, RKassiou, MChalon, SDollé, FBesnard, JCGuilloteau, DEmond, P Synthesis and in vitro evaluation of novel derivatives of diphenylsulfide as serotonin transporter ligands. Bioorg Med Chem Lett16:1297-300 (2006) 
 
Sodium-dependent serotonin transporter
Name:Sodium-dependent serotonin transporter
Type:Multi-pass membrane protein
Mol. Mass.:70322.51
Organism:Homo sapiens (Human)
Description:P31645
Residue:630
BDBM50178934
NameBDBM50178934
Synonyms:2-(2-((dimethylamino)methyl)phenylsulfinyl)-5-methylbenzenamine | CHEMBL203821
TypeSmall organic molecule
Emp. Form.C16H20N2OS
Mol. Mass.288.408
SMILESCN(C)Cc1ccccc1S(=O)c1ccc(C)cc1N