Reaction Details
TargetThyroid hormone receptor beta
LigandBDBM50178975
Substrate/Competitorn/a
Meas. Tech.ChEMBL_338346 (CHEMBL866542)
IC50 0.06±n/a nM
Citation Garcia Collazo, AMKoehler, KFGarg, NFärnegårdh, MHusman, BYe, LLjunggren, JMellström, KSandberg, JGrynfarb, MAhola, HMalm, J Thyroid receptor ligands. Part 5: novel bicyclic agonist ligands selective for the thyroid hormone receptor beta. Bioorg Med Chem Lett16:1240-4 (2006) 
 
Thyroid hormone receptor beta
Name:Thyroid hormone receptor beta
Type:Receptor
Mol. Mass.:52793.62
Organism:Homo sapiens (Human)
Description:Recombinant hThR was obtained from nuclear extracts from SF9 cells infected with baculovirus vectors encoding for ThRbeta 1.
Residue:461
BDBM50178975
NameBDBM50178975
Synonyms:4,6-dichloro-5-(4-hydroxy-3-isopropylphenoxy)-1H-indole-2-carboxylic acid | CHEMBL203777
TypeSmall organic molecule
Emp. Form.C18H15Cl2NO4
Mol. Mass.380.222
SMILESCC(C)c1cc(Oc2c(Cl)cc3[nH]c(cc3c2Cl)C(O)=O)ccc1O