Reaction Details
TargetReplicative DNA helicase
LigandBDBM50178995
Substrate/Competitorn/a
Meas. Tech.ChEMBL_338400 (CHEMBL866546)
IC50 31000±n/a nM
Citation McKay, GAReddy, RArhin, FBelley, ALehoux, DMoeck, GSarmiento, IParr, TRGros, PPelletier, JFar, AR Triaminotriazine DNA helicase inhibitors with antibacterial activity. Bioorg Med Chem Lett16:1286-90 (2006) 
 
Replicative DNA helicase
Name:Replicative DNA helicase
Synonyms:n/a
Type:PROTEIN
Mol. Mass.:51573.81
Organism:Pseudomonas aeruginosa
Description:ChEMBL_338400
Residue:464
BDBM50178995
NameBDBM50178995
TypeSmall organic molecule
Emp. Form.C21H15Cl3N6
Mol. Mass.457.743
SMILESClc1cccc(Nc2nc(Nc3cccc(Cl)c3)nc(Nc3cccc(Cl)c3)n2)c1