Reaction Details
TargetReplicative DNA helicase
LigandBDBM50178998
Substrate/Competitorn/a
Meas. Tech.ChEMBL_338400 (CHEMBL866546)
IC50 6000±n/a nM
Citation McKay, GAReddy, RArhin, FBelley, ALehoux, DMoeck, GSarmiento, IParr, TRGros, PPelletier, JFar, AR Triaminotriazine DNA helicase inhibitors with antibacterial activity. Bioorg Med Chem Lett16:1286-90 (2006) 
 
Replicative DNA helicase
Name:Replicative DNA helicase
Synonyms:n/a
Type:PROTEIN
Mol. Mass.:51573.81
Organism:Pseudomonas aeruginosa
Description:ChEMBL_338400
Residue:464
BDBM50178998
NameBDBM50178998
TypeSmall organic molecule
Emp. Form.C23H18Br2N6O
Mol. Mass.554.237
SMILESCC(=O)c1ccc(Nc2nc(Nc3ccc(Br)cc3)nc(Nc3ccc(Br)cc3)n2)cc1