Reaction Details
TargetReplicative DNA helicase
LigandBDBM50178999
Substrate/Competitorn/a
Meas. Tech.ChEMBL_338400 (CHEMBL866546)
IC50 18000±n/a nM
Citation McKay, GAReddy, RArhin, FBelley, ALehoux, DMoeck, GSarmiento, IParr, TRGros, PPelletier, JFar, AR Triaminotriazine DNA helicase inhibitors with antibacterial activity. Bioorg Med Chem Lett16:1286-90 (2006) 
 
Replicative DNA helicase
Name:Replicative DNA helicase
Synonyms:n/a
Type:PROTEIN
Mol. Mass.:51573.81
Organism:Pseudomonas aeruginosa
Description:ChEMBL_338400
Residue:464
BDBM50178999
NameBDBM50178999
TypeSmall organic molecule
Emp. Form.C21H21F4N7O
Mol. Mass.463.4314
SMILESOCCN1CCN(CC1)c1nc(Nc2ccc(F)c(F)c2)nc(Nc2ccc(F)c(F)c2)n1