Reaction Details
TargetReplicative DNA helicase
LigandBDBM50179000
Substrate/Competitorn/a
Meas. Tech.ChEMBL_338400 (CHEMBL866546)
IC50 5000±n/a nM
Citation McKay, GAReddy, RArhin, FBelley, ALehoux, DMoeck, GSarmiento, IParr, TRGros, PPelletier, JFar, AR Triaminotriazine DNA helicase inhibitors with antibacterial activity. Bioorg Med Chem Lett16:1286-90 (2006) 
 
Replicative DNA helicase
Name:Replicative DNA helicase
Synonyms:n/a
Type:PROTEIN
Mol. Mass.:51573.81
Organism:Pseudomonas aeruginosa
Description:ChEMBL_338400
Residue:464
BDBM50179000
NameBDBM50179000
TypeSmall organic molecule
Emp. Form.C21H23ClN8O3
Mol. Mass.470.912
SMILES[O-][N+](=O)c1ccc(Nc2nc(NCCN3CCOCC3)nc(Nc3ccc(Cl)cc3)n2)cc1