Reaction Details
TargetReplicative DNA helicase
LigandBDBM50179002
Substrate/Competitorn/a
Meas. Tech.ChEMBL_338400 (CHEMBL866546)
IC50 20000±n/a nM
Citation McKay, GAReddy, RArhin, FBelley, ALehoux, DMoeck, GSarmiento, IParr, TRGros, PPelletier, JFar, AR Triaminotriazine DNA helicase inhibitors with antibacterial activity. Bioorg Med Chem Lett16:1286-90 (2006) 
 
Replicative DNA helicase
Name:Replicative DNA helicase
Synonyms:n/a
Type:PROTEIN
Mol. Mass.:51573.81
Organism:Pseudomonas aeruginosa
Description:ChEMBL_338400
Residue:464
BDBM50179002
NameBDBM50179002
TypeSmall organic molecule
Emp. Form.C21H23Cl2N7O
Mol. Mass.460.36
SMILESClc1ccc(Nc2nc(NCCN3CCOCC3)nc(Nc3ccc(Cl)cc3)n2)cc1