Reaction Details
TargetAdenosine receptor A3
LigandBDBM50179041
Substrate/Competitorn/a
Meas. Tech.ChEMBL_338529 (CHEMBL867190)
Ki 77.6±n/a nM
Citation González, MPTerán, CTeijeira, M A topological function based on spectral moments for predicting affinity toward A3 adenosine receptors. Bioorg Med Chem Lett16:1291-6 (2006) 
 
Adenosine receptor A3
Name:Adenosine receptor A3
Type:PROTEIN
Mol. Mass.:36643.73
Organism:Rattus norvegicus
Description:ChEMBL_479910
Residue:320
BDBM50179041
NameBDBM50179041
Synonyms:1-(2-chloro-9-((2R,3R,4S,5S)-5-(ethylcarbamoyl)-3,4-dihydroxy-tetrahydrofuran-2-yl)-9H-purin-6-yl)-3-(3-chlorophenyl)urea | CHEMBL380914
TypeSmall organic molecule
Emp. Form.C19H19Cl2N7O5
Mol. Mass.496.304
SMILESCCNC(=O)[C@H]1O[C@H]([C@H](O)[C@@H]1O)n1cnc2c(NC(=O)Nc3cccc(Cl)c3)nc(Cl)nc12