Reaction Details
Target5-hydroxytryptamine receptor 2A
LigandBDBM50179075
Substrate/Competitorn/a
Meas. Tech.ChEMBL_340092 (CHEMBL861242)
Ki 217±n/a nM
Citation Richter, HGAdams, DRBenardeau, ABickerdike, MJBentley, JMBlench, TJCliffe, IADourish, CHebeisen, PKennett, GAKnight, ARMalcolm, CSMattei, PMisra, AMizrahi, JMonck, NJPlancher, JMRoever, SRoffey, JRTaylor, SVickers, SP Synthesis and biological evaluation of novel hexahydro-pyrido[3',2':4,5]pyrrolo[1,2-a]pyrazines as potent and selective 5-HT(2C) receptor agonists. Bioorg Med Chem Lett16:1207-11 (2006) 
 
5-hydroxytryptamine receptor 2A
Name:5-hydroxytryptamine receptor 2A
Type:undefined
Mol. Mass.:52607.65
Organism:Homo sapiens (Human)
Description:P28223
Residue:471
BDBM50179075
NameBDBM50179075
Synonyms:6-chloro-1,2,3,4,9,9a-hexahydro-2,4a,5-triaza-fluorene | CHEMBL203025
TypeSmall organic molecule
Emp. Form.C10H12ClN3
Mol. Mass.209.675
SMILESClc1ccc2CC3CNCCN3c2n1