Reaction Details
Target5-hydroxytryptamine receptor 2A
LigandBDBM50179076
Substrate/Competitorn/a
Meas. Tech.ChEMBL_340092 (CHEMBL861242)
Ki 58±n/a nM
Citation Richter, HGAdams, DRBenardeau, ABickerdike, MJBentley, JMBlench, TJCliffe, IADourish, CHebeisen, PKennett, GAKnight, ARMalcolm, CSMattei, PMisra, AMizrahi, JMonck, NJPlancher, JMRoever, SRoffey, JRTaylor, SVickers, SP Synthesis and biological evaluation of novel hexahydro-pyrido[3',2':4,5]pyrrolo[1,2-a]pyrazines as potent and selective 5-HT(2C) receptor agonists. Bioorg Med Chem Lett16:1207-11 (2006) 
 
5-hydroxytryptamine receptor 2A
Name:5-hydroxytryptamine receptor 2A
Type:undefined
Mol. Mass.:52607.65
Organism:Homo sapiens (Human)
Description:P28223
Residue:471
BDBM50179076
NameBDBM50179076
Synonyms:(4R,9aS)-6-bromo-4-methyl-1,2,3,4,9,9a-hexahydro-2,4a,5-triaza-fluorene | CHEMBL383694
TypeSmall organic molecule
Emp. Form.C11H14BrN3
Mol. Mass.268.153
SMILESC[C@@H]1CNC[C@@H]2Cc3ccc(Br)nc3N12