Reaction Details
TargetPotassium voltage-gated channel subfamily H member 2
LigandBDBM50179080
Substrate/Competitorn/a
Meas. Tech.ChEMBL_340115 (CHEMBL865567)
IC50 40000±n/a nM
Citation Richter, HGAdams, DRBenardeau, ABickerdike, MJBentley, JMBlench, TJCliffe, IADourish, CHebeisen, PKennett, GAKnight, ARMalcolm, CSMattei, PMisra, AMizrahi, JMonck, NJPlancher, JMRoever, SRoffey, JRTaylor, SVickers, SP Synthesis and biological evaluation of novel hexahydro-pyrido[3',2':4,5]pyrrolo[1,2-a]pyrazines as potent and selective 5-HT(2C) receptor agonists. Bioorg Med Chem Lett16:1207-11 (2006) 
 
Potassium voltage-gated channel subfamily H member 2
Name:Potassium voltage-gated channel subfamily H member 2
Type:Multi-pass membrane protein
Mol. Mass.:126672.65
Organism:Homo sapiens (Human)
Description:Q12809
Residue:1159
BDBM50179080
NameBDBM50179080
Synonyms:(4R,9aR)-6-chloro-4-methyl-1,2,3,4,9,9a-hexahydro-2,4a,5-triaza-fluorene | CHEMBL203230
TypeSmall organic molecule
Emp. Form.C11H14ClN3
Mol. Mass.223.702
SMILESC[C@@H]1CNC[C@H]2Cc3ccc(Cl)nc3N12