Reaction Details
TargetPotassium voltage-gated channel subfamily H member 2
LigandBDBM50169261
Substrate/Competitorn/a
Meas. Tech.ChEMBL_340115 (CHEMBL865567)
IC50 2500±n/a nM
Citation Richter, HGAdams, DRBenardeau, ABickerdike, MJBentley, JMBlench, TJCliffe, IADourish, CHebeisen, PKennett, GAKnight, ARMalcolm, CSMattei, PMisra, AMizrahi, JMonck, NJPlancher, JMRoever, SRoffey, JRTaylor, SVickers, SP Synthesis and biological evaluation of novel hexahydro-pyrido[3',2':4,5]pyrrolo[1,2-a]pyrazines as potent and selective 5-HT(2C) receptor agonists. Bioorg Med Chem Lett16:1207-11 (2006) 
 
Potassium voltage-gated channel subfamily H member 2
Name:Potassium voltage-gated channel subfamily H member 2
Type:Multi-pass membrane protein
Mol. Mass.:126672.65
Organism:Homo sapiens (Human)
Description:Q12809
Residue:1159
BDBM50169261
NameBDBM50169261
Synonyms:(4R,10aS)-7-Chloro-4,6-dimethyl-1,2,3,4,10,10a-hexahydro-pyrazino[1,2-a]indole CHEMBL191054
TypeSmall organic molecule
Emp. Form.C13H17ClN2
Mol. Mass.236.74
SMILESC[C@@H]1CNC[C@@H]2Cc3ccc(Cl)c(C)c3N12