Reaction Details
Target5-hydroxytryptamine receptor 2B
LigandBDBM50179080
Substrate/Competitorn/a
Meas. Tech.ChEMBL_340093 (CHEMBL861243)
Ki 48±n/a nM
Citation Richter, HGAdams, DRBenardeau, ABickerdike, MJBentley, JMBlench, TJCliffe, IADourish, CHebeisen, PKennett, GAKnight, ARMalcolm, CSMattei, PMisra, AMizrahi, JMonck, NJPlancher, JMRoever, SRoffey, JRTaylor, SVickers, SP Synthesis and biological evaluation of novel hexahydro-pyrido[3',2':4,5]pyrrolo[1,2-a]pyrazines as potent and selective 5-HT(2C) receptor agonists. Bioorg Med Chem Lett16:1207-11 (2006) 
 
5-hydroxytryptamine receptor 2B
Name:5-hydroxytryptamine receptor 2B
Type:G Protein-Coupled Receptor (GPCR)
Mol. Mass.:54312.47
Organism:Homo sapiens (Human)
Description:Receptor binding assays were performed using human clone stably expressed in CHO cells.
Residue:481
BDBM50179080
NameBDBM50179080
Synonyms:(4R,9aR)-6-chloro-4-methyl-1,2,3,4,9,9a-hexahydro-2,4a,5-triaza-fluorene | CHEMBL203230
TypeSmall organic molecule
Emp. Form.C11H14ClN3
Mol. Mass.223.702
SMILESC[C@@H]1CNC[C@H]2Cc3ccc(Cl)nc3N12