Reaction Details
Target5-hydroxytryptamine receptor 2A
LigandBDBM50179087
Substrate/Competitorn/a
Meas. Tech.ChEMBL_340092 (CHEMBL861242)
Ki 65±n/a nM
Citation Richter, HGAdams, DRBenardeau, ABickerdike, MJBentley, JMBlench, TJCliffe, IADourish, CHebeisen, PKennett, GAKnight, ARMalcolm, CSMattei, PMisra, AMizrahi, JMonck, NJPlancher, JMRoever, SRoffey, JRTaylor, SVickers, SP Synthesis and biological evaluation of novel hexahydro-pyrido[3',2':4,5]pyrrolo[1,2-a]pyrazines as potent and selective 5-HT(2C) receptor agonists. Bioorg Med Chem Lett16:1207-11 (2006) 
 
5-hydroxytryptamine receptor 2A
Name:5-hydroxytryptamine receptor 2A
Type:undefined
Mol. Mass.:52607.65
Organism:Homo sapiens (Human)
Description:P28223
Residue:471
BDBM50179087
NameBDBM50179087
Synonyms:(4R,9aR)-6-[1-((S)-ethoxy)-ethyl]-4-methyl-1,2,3,4,9,9a-hexahydro-2,4a,5-triaza-fluorene | CHEMBL206394
TypeSmall organic molecule
Emp. Form.C15H23N3O
Mol. Mass.261.3626
SMILESCCO[C@@H](C)c1ccc2C[C@@H]3CNC[C@@H](C)N3c2n1