Reaction Details
TargetPutative sugar transporter
LigandBDBM50179099
Substrate/Competitorn/a
Meas. Tech.ChEMBL_338364 (CHEMBL866544)
Ki 81000±n/a nM
Citation Fayolle, MIonita, MKrishna, SMorin, CPatel, AP Probing structure/affinity relationships for the Plasmodium falciparum hexose transporter with glucose derivatives. Bioorg Med Chem Lett16:1267-71 (2006) 
 
Putative sugar transporter
Name:Putative sugar transporter
Synonyms:Hexose transporter 1
Type:PROTEIN
Mol. Mass.:56427.07
Organism:Plasmodium falciparum
Description:ChEMBL_456666
Residue:504
BDBM50179099
NameBDBM50179099
TypeSmall organic molecule
Emp. Form.C21H34O6
Mol. Mass.382.4911
SMILESCCCCc1ccc(CCCCCO[C@@H]2[C@@H](O)C(O)O[C@H](CO)[C@H]2O)cc1