Reaction Details
TargetPutative sugar transporter
LigandBDBM50179106
Substrate/Competitorn/a
Meas. Tech.ChEMBL_338364 (CHEMBL866544)
Ki 148000±n/a nM
Citation Fayolle, MIonita, MKrishna, SMorin, CPatel, AP Probing structure/affinity relationships for the Plasmodium falciparum hexose transporter with glucose derivatives. Bioorg Med Chem Lett16:1267-71 (2006) 
 
Putative sugar transporter
Name:Putative sugar transporter
Synonyms:Hexose transporter 1
Type:PROTEIN
Mol. Mass.:56427.07
Organism:Plasmodium falciparum
Description:ChEMBL_456666
Residue:504
BDBM50179106
NameBDBM50179106
TypeSmall organic molecule
Emp. Form.C20H32O6
Mol. Mass.368.4645
SMILESOC[C@H]1OC(O)[C@H](O)[C@@H](OCCCCCCCCc2ccccc2)[C@@H]1O