Reaction Details
TargetPutative sugar transporter
LigandBDBM50179111
Substrate/Competitorn/a
Meas. Tech.ChEMBL_338364 (CHEMBL866544)
Ki 30000±n/a nM
Citation Fayolle, MIonita, MKrishna, SMorin, CPatel, AP Probing structure/affinity relationships for the Plasmodium falciparum hexose transporter with glucose derivatives. Bioorg Med Chem Lett16:1267-71 (2006) 
 
Putative sugar transporter
Name:Putative sugar transporter
Synonyms:Hexose transporter 1
Type:PROTEIN
Mol. Mass.:56427.07
Organism:Plasmodium falciparum
Description:ChEMBL_456666
Residue:504
BDBM50179111
NameBDBM50179111
TypeSmall organic molecule
Emp. Form.C18H36O6
Mol. Mass.348.4748
SMILESCCCCCCCCCCCCO[C@@H]1[C@@H](O)C(O)O[C@H](CO)[C@H]1O