Reaction Details
TargetRetinoic acid receptor RXR-beta
LigandBDBM50179117
Substrate/Competitorn/a
Meas. Tech.ChEMBL_349698 (CHEMBL866289)
EC50 95±n/a nM
Citation Farmer, LJMarron, KSCanan Koch, SSHwang, CKKallel, EAZhi, LNadzan, AMRobertson, DWBennani, YL Aza-retinoids as novel retinoid X receptor-specific agonists. Bioorg Med Chem Lett16:2352-6 (2006) 
 
Retinoic acid receptor RXR-beta
Name:Retinoic acid receptor RXR-beta
Type:PROTEIN
Mol. Mass.:56932.89
Organism:Homo sapiens (Human)
Description:ChEMBL_39045
Residue:533
BDBM50179117
NameBDBM50179117
Synonyms:(2E,4E)-6-((3,5-di-tert-butylphenyl)(methyl)amino)-3-methylhexa-2,4-dienoic acid | CHEMBL208213
TypeSmall organic molecule
Emp. Form.C22H33NO2
Mol. Mass.343.5029
SMILESCN(C\C=C\C(\C)=C\C(O)=O)c1cc(cc(c1)C(C)(C)C)C(C)(C)C