Reaction Details
TargetRetinoic acid receptor RXR-beta
LigandBDBM50179130
Substrate/Competitorn/a
Meas. Tech.ChEMBL_349698 (CHEMBL866289)
EC50 151±n/a nM
Citation Farmer, LJMarron, KSCanan Koch, SSHwang, CKKallel, EAZhi, LNadzan, AMRobertson, DWBennani, YL Aza-retinoids as novel retinoid X receptor-specific agonists. Bioorg Med Chem Lett16:2352-6 (2006) 
 
Retinoic acid receptor RXR-beta
Name:Retinoic acid receptor RXR-beta
Type:PROTEIN
Mol. Mass.:56932.89
Organism:Homo sapiens (Human)
Description:ChEMBL_39045
Residue:533
BDBM50179130
NameBDBM50179130
Synonyms:(2E,4E)-6-((3,5-di-tert-butylphenyl)(propyl)amino)-3-methyl-6-oxohexa-2,4-dienoic acid | CHEMBL206005
TypeSmall organic molecule
Emp. Form.C24H35NO3
Mol. Mass.385.5396
SMILESCCCN(C(=O)\C=C\C(\C)=C\C(O)=O)c1cc(cc(c1)C(C)(C)C)C(C)(C)C