Reaction Details
TargetRetinoic acid receptor RXR-beta
LigandBDBM50179113
Substrate/Competitorn/a
Meas. Tech.ChEMBL_349698 (CHEMBL866289)
EC50 52±n/a nM
Citation Farmer, LJMarron, KSCanan Koch, SSHwang, CKKallel, EAZhi, LNadzan, AMRobertson, DWBennani, YL Aza-retinoids as novel retinoid X receptor-specific agonists. Bioorg Med Chem Lett16:2352-6 (2006) 
 
Retinoic acid receptor RXR-beta
Name:Retinoic acid receptor RXR-beta
Type:PROTEIN
Mol. Mass.:56932.89
Organism:Homo sapiens (Human)
Description:ChEMBL_39045
Residue:533
BDBM50179113
NameBDBM50179113
Synonyms:(2E,4E)-6-(butyl(6-tert-butyl-1,1-dimethyl-2,3-dihydro-1H-inden-4-yl)amino)-3-methylhexa-2,4-dienoic acid | CHEMBL204725
TypeSmall organic molecule
Emp. Form.C26H39NO2
Mol. Mass.397.5934
SMILESCCCCN(C\C=C\C(\C)=C\C(O)=O)c1cc(cc2c1CCC2(C)C)C(C)(C)C