Reaction Details
TargetRetinoic acid receptor RXR-beta
LigandBDBM50179131
Substrate/Competitorn/a
Meas. Tech.ChEMBL_349698 (CHEMBL866289)
EC50 117±n/a nM
Citation Farmer, LJMarron, KSCanan Koch, SSHwang, CKKallel, EAZhi, LNadzan, AMRobertson, DWBennani, YL Aza-retinoids as novel retinoid X receptor-specific agonists. Bioorg Med Chem Lett16:2352-6 (2006) 
 
Retinoic acid receptor RXR-beta
Name:Retinoic acid receptor RXR-beta
Type:PROTEIN
Mol. Mass.:56932.89
Organism:Homo sapiens (Human)
Description:ChEMBL_39045
Residue:533
BDBM50179131
NameBDBM50179131
Synonyms:(2E,4E)-6-(ethyl(3,5,5,8,8-pentamethyl-5,6,7,8-tetrahydronaphthalen-2-yl)amino)-3-methylhexa-2,4-dienoic acid | CHEMBL427391
TypeSmall organic molecule
Emp. Form.C24H35NO2
Mol. Mass.369.5402
SMILESCCN(C\C=C\C(\C)=C\C(O)=O)c1cc2c(cc1C)C(C)(C)CCC2(C)C