Reaction Details
TargetMu-type opioid receptor
LigandBDBM50179186
Substrate/Competitorn/a
Meas. Tech.ChEMBL_325355 (CHEMBL861055)
Ki 1.02±n/a nM
Citation Balboni, GGuerrini, RSalvadori, SNegri, LGiannini, EBryant, SDJinsmaa, YLazarus, LH Conversion of the potent delta-opioid agonist H-Dmt-Tic-NH-CH(2)-bid into delta-opioid antagonists by N(1)-benzimidazole alkylation(1). J Med Chem48:8112-4 (2005) 
 
Mu-type opioid receptor
Name:Mu-type opioid receptor
Type:G Protein-Coupled Receptor (GPCR)
Mol. Mass.:44503.11
Organism:Rattus norvegicus (rat)
Description:Competition binding assays were carried out using membrane preparations from transfected HN9.10 cells that constitutively expressed the mu opioid receptor.
Residue:398
BDBM50179186
NameBDBM50179186
Synonyms:(S)-2-((S)-2-amino-3-(4-hydroxy-2,6-dimethylphenyl)propanoyl)-N-((1-benzyl-1H-benzo[d]imidazol-2-yl)methyl)-1,2,3,4-tetrahydroisoquinoline-3-carboxamide | CHEMBL436063
TypeSmall organic molecule
Emp. Form.C36H37N5O3
Mol. Mass.587.7107
SMILESCc1cc(O)cc(C)c1C[C@H](N)C(=O)N1Cc2ccccc2C[C@H]1C(=O)NCc1nc2ccccc2n1Cc1ccccc1