Reaction Details
TargetMu-type opioid receptor
LigandBDBM50179189
Substrate/Competitorn/a
Meas. Tech.ChEMBL_325358 (CHEMBL861058)
IC50 72±n/a nM
Citation Balboni, GGuerrini, RSalvadori, SNegri, LGiannini, EBryant, SDJinsmaa, YLazarus, LH Conversion of the potent delta-opioid agonist H-Dmt-Tic-NH-CH(2)-bid into delta-opioid antagonists by N(1)-benzimidazole alkylation(1). J Med Chem48:8112-4 (2005) 
 
Mu-type opioid receptor
Name:Mu-type opioid receptor
Type:Enzyme Catalytic Domain
Mol. Mass.:11165.58
Organism:GUINEA PIG
Description:P97266
Residue:98
BDBM50179189
NameBDBM50179189
Synonyms:(S)-N-((1-allyl-1H-benzo[d]imidazol-2-yl)methyl)-2-((S)-2-amino-3-(4-hydroxy-2,6-dimethylphenyl)propanoyl)-1,2,3,4-tetrahydroisoquinoline-3-carboxamide | CHEMBL354392
TypeSmall organic molecule
Emp. Form.C32H35N5O3
Mol. Mass.537.652
SMILESCc1cc(O)cc(C)c1C[C@H](N)C(=O)N1Cc2ccccc2C[C@H]1C(=O)NCc1nc2ccccc2n1CC=C