Reaction Details
TargetPlatelet-derived growth factor receptor beta
LigandBDBM50179211
Substrate/Competitorn/a
Meas. Tech.ChEMBL_325211 (CHEMBL861464)
IC50 32±n/a nM
Citation Ho, CYLudovici, DWMaharoof, USMei, JSechler, JLTuman, RWStrobel, EDAndraka, LYen, HKLeo, GLi, JAlmond, HLu, HDeVine, ATominovich, RMBaker, JEmanuel, SGruninger, RHMiddleton, SAJohnson, DLGalemmo, RA (6,7-Dimethoxy-2,4-dihydroindeno[1,2-c]pyrazol-3-yl)phenylamines: platelet-derived growth factor receptor tyrosine kinase inhibitors with broad antiproliferative activity against tumor cells. J Med Chem48:8163-73 (2005) 
 
Platelet-derived growth factor receptor beta
Name:Platelet-derived growth factor receptor beta
Type:Enzyme
Mol. Mass.:123922.25
Organism:Homo sapiens (Human)
Description:P09619
Residue:1106
BDBM50179211
NameBDBM50179211
Synonyms:3-bromo-N-(6,7-dimethoxy-2,4-dihydroindeno[1,2-c]pyrazol-3-yl)phenylamine | CHEMBL120862
TypeSmall organic molecule
Emp. Form.C18H16BrN3O2
Mol. Mass.386.243
SMILESCOc1cc2Cc3c(Nc4cccc(Br)c4)[nH]nc3-c2cc1OC