Reaction Details
TargetPlatelet-derived growth factor receptor beta
LigandBDBM50179205
Substrate/Competitorn/a
Meas. Tech.ChEMBL_325210 (CHEMBL861463)
IC50 317±n/a nM
Citation Ho, CYLudovici, DWMaharoof, USMei, JSechler, JLTuman, RWStrobel, EDAndraka, LYen, HKLeo, GLi, JAlmond, HLu, HDeVine, ATominovich, RMBaker, JEmanuel, SGruninger, RHMiddleton, SAJohnson, DLGalemmo, RA (6,7-Dimethoxy-2,4-dihydroindeno[1,2-c]pyrazol-3-yl)phenylamines: platelet-derived growth factor receptor tyrosine kinase inhibitors with broad antiproliferative activity against tumor cells. J Med Chem48:8163-73 (2005) 
 
Platelet-derived growth factor receptor beta
Name:Platelet-derived growth factor receptor beta
Type:Enzyme
Mol. Mass.:123922.25
Organism:Homo sapiens (Human)
Description:P09619
Residue:1106
BDBM50179205
NameBDBM50179205
Synonyms:(2,4-dihydroindeno[1,2-c]pyrazol-3-yl)phenylamine | CHEMBL175596
TypeSmall organic molecule
Emp. Form.C16H13N3
Mol. Mass.247.2945
SMILESC1c2ccccc2-c2n[nH]c(Nc3ccccc3)c12