Reaction Details
TargetPlatelet-derived growth factor receptor beta
LigandBDBM50179218
Substrate/Competitorn/a
Meas. Tech.ChEMBL_325210 (CHEMBL861463)
IC50 5420±n/a nM
Citation Ho, CYLudovici, DWMaharoof, USMei, JSechler, JLTuman, RWStrobel, EDAndraka, LYen, HKLeo, GLi, JAlmond, HLu, HDeVine, ATominovich, RMBaker, JEmanuel, SGruninger, RHMiddleton, SAJohnson, DLGalemmo, RA (6,7-Dimethoxy-2,4-dihydroindeno[1,2-c]pyrazol-3-yl)phenylamines: platelet-derived growth factor receptor tyrosine kinase inhibitors with broad antiproliferative activity against tumor cells. J Med Chem48:8163-73 (2005) 
 
Platelet-derived growth factor receptor beta
Name:Platelet-derived growth factor receptor beta
Type:Enzyme
Mol. Mass.:123922.25
Organism:Homo sapiens (Human)
Description:P09619
Residue:1106
BDBM50179218
NameBDBM50179218
Synonyms:2,4-dichloro-N-(6,7-dimethoxy-2,4-dihydroindeno[1,2-c]pyrazol-3-yl)phenylamine | CHEMBL198642
TypeSmall organic molecule
Emp. Form.C18H15Cl2N3O2
Mol. Mass.376.237
SMILESCOc1cc2Cc3c(Nc4ccc(Cl)cc4Cl)[nH]nc3-c2cc1OC