Reaction Details
TargetPlatelet-derived growth factor receptor beta
LigandBDBM50179221
Substrate/Competitorn/a
Meas. Tech.ChEMBL_325210 (CHEMBL861463)
IC50 110±n/a nM
Citation Ho, CYLudovici, DWMaharoof, USMei, JSechler, JLTuman, RWStrobel, EDAndraka, LYen, HKLeo, GLi, JAlmond, HLu, HDeVine, ATominovich, RMBaker, JEmanuel, SGruninger, RHMiddleton, SAJohnson, DLGalemmo, RA (6,7-Dimethoxy-2,4-dihydroindeno[1,2-c]pyrazol-3-yl)phenylamines: platelet-derived growth factor receptor tyrosine kinase inhibitors with broad antiproliferative activity against tumor cells. J Med Chem48:8163-73 (2005) 
 
Platelet-derived growth factor receptor beta
Name:Platelet-derived growth factor receptor beta
Type:Enzyme
Mol. Mass.:123922.25
Organism:Homo sapiens (Human)
Description:P09619
Residue:1106
BDBM50179221
NameBDBM50179221
Synonyms:2-chloro-N-(6,7-dimethoxy-2,4-dihydroindeno[1,2-c]pyrazol-3-yl)phenylamine | CHEMBL200774
TypeSmall organic molecule
Emp. Form.C18H16ClN3O2
Mol. Mass.341.792
SMILESCOc1cc2Cc3c(Nc4ccccc4Cl)[nH]nc3-c2cc1OC