Reaction Details
TargetPeroxisome proliferator-activated receptor gamma
LigandBDBM50179225
Substrate/Competitorn/a
Meas. Tech.ChEMBL_325379 (CHEMBL861059)
IC50 127±n/a nM
Citation Mahindroo, NHuang, CFPeng, YHWang, CCLiao, CCLien, TWChittimalla, SKHuang, WJChai, CHPrakash, EChen, CPHsu, TAPeng, CHLu, ILLee, LHChang, YWChen, WCChou, YCChen, CTGoparaju, CMChen, YSLan, SJYu, MCChen, XChao, YSWu, SYHsieh, HP Novel indole-based peroxisome proliferator-activated receptor agonists: design, SAR, structural biology, and biological activities. J Med Chem48:8194-208 (2005) 
 
Peroxisome proliferator-activated receptor gamma
Name:Peroxisome proliferator-activated receptor gamma
Type:Nuclear Receptor
Mol. Mass.:57613.46
Organism:Homo sapiens (Human)
Description:P37231
Residue:505
BDBM50179225
NameBDBM50179225
Synonyms:2-{4-[3-(3-phenyl-7-propylbenzo[d]isoxazol-6-yloxy)propoxy]-indol-1-yl}ethanoic acid | CHEMBL197496
TypeSmall organic molecule
Emp. Form.C29H28N2O5
Mol. Mass.484.543
SMILESCCCc1c(OCCCOc2cccc3n(CC(O)=O)ccc23)ccc2c(noc12)-c1ccccc1