Reaction Details
TargetFibroblast growth factor 2
LigandBDBM50179256
Substrate/Competitorn/a
Meas. Tech.ChEMBL_325519 (CHEMBL859218)
Kd 84±n/a nM
Citation Karoli, TLiu, LFairweather, JKHammond, ELi, CPCochran, SBergefall, KTrybala, EAddison, RSFerro, V Synthesis, biological activity, and preliminary pharmacokinetic evaluation of analogues of a phosphosulfomannan angiogenesis inhibitor (PI-88). J Med Chem48:8229-36 (2005) 
 
Fibroblast growth factor 2
Name:Fibroblast growth factor 2
Type:Protein
Mol. Mass.:30803.89
Organism:Homo sapiens (Human)
Description:P09038
Residue:288
BDBM50179256
NameBDBM50179256
Synonyms:6-{5-[(3aS,4S,6aR)-2-oxo-hexahydro-1H-thieno[3,4-d]imidazolidin-4-yl]pentanamido}-N-[(2S,3S,4S,5S,6R)-3-{[(2R,3S,4S,5R,6R)-4-{[(2R,3S,4S,5R,6R)-4-{[(2R,3S,4S,5R,6R)-3,5-dihydroxy-6-(hydroxymethyl)-4-{[(2R,3S,4S,5S,6R)-3,4,5-trihydroxy-6-(hydroxymethyl)oxan-2-yl]oxy}oxan-2-yl]oxy}-3,5-dihydroxy-6-(hydroxymethyl)oxan-2-yl]oxy}-3,5-dihydroxy-6-(hydroxymethyl)oxan-2-yl]oxy}-4,5-dihydroxy-6-(hydroxymethyl)oxan-2-yl]hexanamide | CHEMBL262707
TypeSmall organic molecule
Emp. Form.C46H78N4O28S
Mol. Mass.1167.187
SMILESOC[C@H]1O[C@H](NC(=O)CCCCCNC(=O)CCCC[C@@H]2SC[C@@H]3NC(=O)N[C@H]23)[C@@H](O[C@H]2O[C@H](CO)[C@@H](O)[C@H](O[C@H]3O[C@H](CO)[C@@H](O)[C@H](O[C@H]4O[C@H](CO)[C@@H](O)[C@H](O[C@H]5O[C@H](CO)[C@@H](O)[C@H](O)[C@@H]5O)[C@@H]4O)[C@@H]3O)[C@@H]2O)[C@@H](O)[C@@H]1O