Reaction Details
TargetFibroblast growth factor 2
LigandBDBM50179253
Substrate/Competitorn/a
Meas. Tech.ChEMBL_325519 (CHEMBL859218)
Kd 68±n/a nM
Citation Karoli, TLiu, LFairweather, JKHammond, ELi, CPCochran, SBergefall, KTrybala, EAddison, RSFerro, V Synthesis, biological activity, and preliminary pharmacokinetic evaluation of analogues of a phosphosulfomannan angiogenesis inhibitor (PI-88). J Med Chem48:8229-36 (2005) 
 
Fibroblast growth factor 2
Name:Fibroblast growth factor 2
Type:Protein
Mol. Mass.:30803.89
Organism:Homo sapiens (Human)
Description:P09038
Residue:288
BDBM50179253
NameBDBM50179253
Synonyms:(2R,3S,4S,5S,6R)-2-{[(2R,3S,4S,5R,6R)-2-{[(2R,3S,4S,5R,6R)-2-{[(2R,3S,4S,5R,6R)-2-{[(2S,3S,4S,5S,6R)-4,5-dihydroxy-6-(hydroxymethyl)-2-(octyloxy)oxan-3-yl]oxy}-3,5-dihydroxy-6-(hydroxymethyl)oxan-4-yl]oxy}-3,5-dihydroxy-6-(hydroxymethyl)oxan-4-yl]oxy}-3,5-dihydroxy-6-(hydroxymethyl)oxan-4-yl]oxy}-6-(hydroxymethyl)oxane-3,4,5-triol | CHEMBL198643
TypeSmall organic molecule
Emp. Form.C38H68O26
Mol. Mass.940.9309
SMILESCCCCCCCCO[C@H]1O[C@H](CO)[C@@H](O)[C@H](O)[C@@H]1O[C@H]1O[C@H](CO)[C@@H](O)[C@H](O[C@H]2O[C@H](CO)[C@@H](O)[C@H](O[C@H]3O[C@H](CO)[C@@H](O)[C@H](O[C@H]4O[C@H](CO)[C@@H](O)[C@H](O)[C@@H]4O)[C@@H]3O)[C@@H]2O)[C@@H]1O