Reaction Details
TargetBile salt-activated lipase
LigandBDBM50179331
Substrate/Competitorn/a
Meas. Tech.ChEMBL_325182 (CHEMBL861460)
Ki 2150±n/a nM
Citation Pietsch, MGütschow, M Synthesis of tricyclic 1,3-oxazin-4-ones and kinetic analysis of cholesterol esterase and acetylcholinesterase inhibition. J Med Chem48:8270-88 (2005) 
 
Bile salt-activated lipase
Name:Bile salt-activated lipase
Type:PROTEIN
Mol. Mass.:65152.77
Organism:Bos taurus
Description:ChEMBL_154778
Residue:597
BDBM50179331
NameBDBM50179331
Synonyms:5,6,7,8-tetrahydro-2-(dimethylamino)-4H-benzo[4,5]thieno[2,3-d][1,3]oxazin-4-one | CHEMBL8548
TypeSmall organic molecule
Emp. Form.C12H14N2O2S
Mol. Mass.250.317
SMILESCN(C)c1nc2sc3CCCCc3c2c(=O)o1