Reaction Details
TargetHistamine H4 receptor
LigandBDBM50179346
Substrate/Competitorn/a
Meas. Tech.ChEMBL_325600 (CHEMBL860282)
Ki 23±n/a nM
Citation Venable, JDCai, HChai, WDvorak, CAGrice, CAJablonowski, JAShah, CRKwok, AKLy, KSPio, BWei, JDesai, PJJiang, WNguyen, SLing, PWilson, SJDunford, PJThurmond, RLLovenberg, TWKarlsson, LCarruthers, NIEdwards, JP Preparation and biological evaluation of indole, benzimidazole, and thienopyrrole piperazine carboxamides: potent human histamine h(4) antagonists. J Med Chem48:8289-98 (2005) 
 
Histamine H4 receptor
Name:Histamine H4 receptor
Type:G Protein-Coupled Receptor (GPCR)
Mol. Mass.:44517.02
Organism:Homo sapiens (Human)
Description:Binding assays were using CHO cells stably expressing hH4R receptors.
Residue:390
BDBM50179346
NameBDBM50179346
Synonyms:(4-chloro-6-methyl-1H-benzoimidazol-2-yl)(4-methylpiperazin-1-yl)methanone | CHEMBL120854
TypeSmall organic molecule
Emp. Form.C14H17ClN4O
Mol. Mass.292.764
SMILESCN1CCN(CC1)C(=O)c1nc2cc(C)cc(Cl)c2[nH]1