Reaction Details
TargetProstaglandin G/H synthase 2
LigandBDBM50179611
Substrate/Competitorn/a
Meas. Tech.ChEMBL_336080 (CHEMBL865931)
IC50 70±n/a nM
Citation Sakya, SMCheng, HLundy Demello, KMShavnya, AMinich, MLRast, BDutra, JLi, CRafka, RJKoss, DALi, JJaynes, BHZiegler, CBMann, DWPetras, CFSeibel, SBSilvia, AMGeorge, DMHickman, AHaven, MLLynch, MP 5-Heteroatom-substituted pyrazoles as canine COX-2 inhibitors: Part 2. Structure-activity relationship studies of 5-alkylethers and 5-thioethers. Bioorg Med Chem Lett16:1202-6 (2006) 
 
Prostaglandin G/H synthase 2
Name:Prostaglandin G/H synthase 2
Type:PROTEIN
Mol. Mass.:68982.35
Organism:Canis familiaris
Description:ChEMBL_344386
Residue:604
BDBM50179611
NameBDBM50179611
Synonyms:5-(cycloheptyloxy)-1-(5-(methylsulfonyl)pyridin-2-yl)-3-(trifluoromethyl)-1H-pyrazole-4-carbonitrile | CHEMBL381304
TypeSmall organic molecule
Emp. Form.C18H19F3N4O3S
Mol. Mass.428.429
SMILESCS(=O)(=O)c1ccc(nc1)-n1nc(c(C#N)c1OC1CCCCCC1)C(F)(F)F