Reaction Details
TargetVoltage-dependent calcium channel subunit alpha-2/delta-1
LigandBDBM50179705
Substrate/Competitorn/a
Meas. Tech.ChEMBL_335548 (CHEMBL859414)
Ki 20000±n/a nM
Citation Mortell, KHAnderson, DJLynch, JJNelson, SLSarris, KMcDonald, HSabet, RBaker, SHonore, PLee, CHJarvis, MFGopalakrishnan, M Structure-activity relationships of alpha-amino acid ligands for the alpha2delta subunit of voltage-gated calcium channels. Bioorg Med Chem Lett16:1138-41 (2006) 
 
Voltage-dependent calcium channel subunit alpha-2/delta-1
Name:Voltage-dependent calcium channel subunit alpha-2/delta-1
Type:PROTEIN
Mol. Mass.:124608.02
Organism:Mus musculus
Description:ChEMBL_335548
Residue:1103
BDBM50179705
NameBDBM50179705
Synonyms:2-amino-2-(4-chlorophenyl)acetic acid CHEMBL133182
TypeSmall organic molecule
Emp. Form.C8H8ClNO2
Mol. Mass.185.608
SMILESNC(C(O)=O)c1ccc(Cl)cc1