Reaction Details
TargetVoltage-dependent calcium channel subunit alpha-2/delta-1
LigandBDBM50179727
Substrate/Competitorn/a
Meas. Tech.ChEMBL_335548 (CHEMBL859414)
Ki 31±n/a nM
Citation Mortell, KHAnderson, DJLynch, JJNelson, SLSarris, KMcDonald, HSabet, RBaker, SHonore, PLee, CHJarvis, MFGopalakrishnan, M Structure-activity relationships of alpha-amino acid ligands for the alpha2delta subunit of voltage-gated calcium channels. Bioorg Med Chem Lett16:1138-41 (2006) 
 
Voltage-dependent calcium channel subunit alpha-2/delta-1
Name:Voltage-dependent calcium channel subunit alpha-2/delta-1
Type:PROTEIN
Mol. Mass.:124608.02
Organism:Mus musculus
Description:ChEMBL_335548
Residue:1103
BDBM50179727
NameBDBM50179727
Synonyms:4-(3-bromobenzylthio)-2-aminobutanoic acid | CHEMBL380929
TypeSmall organic molecule
Emp. Form.C11H14BrNO2S
Mol. Mass.304.203
SMILESNC(CCSCc1cccc(Br)c1)C(O)=O