Reaction Details
TargetVoltage-dependent calcium channel subunit alpha-2/delta-1
LigandBDBM50179730
Substrate/Competitorn/a
Meas. Tech.ChEMBL_335548 (CHEMBL859414)
Ki 840±n/a nM
Citation Mortell, KHAnderson, DJLynch, JJNelson, SLSarris, KMcDonald, HSabet, RBaker, SHonore, PLee, CHJarvis, MFGopalakrishnan, M Structure-activity relationships of alpha-amino acid ligands for the alpha2delta subunit of voltage-gated calcium channels. Bioorg Med Chem Lett16:1138-41 (2006) 
 
Voltage-dependent calcium channel subunit alpha-2/delta-1
Name:Voltage-dependent calcium channel subunit alpha-2/delta-1
Type:PROTEIN
Mol. Mass.:124608.02
Organism:Mus musculus
Description:ChEMBL_335548
Residue:1103
BDBM50179730
NameBDBM50179730
Synonyms:4-(3-cyanobenzylthio)-2-aminobutanoic acid | CHEMBL380507
TypeSmall organic molecule
Emp. Form.C12H14N2O2S
Mol. Mass.250.317
SMILESNC(CCSCc1cccc(c1)C#N)C(O)=O