Reaction Details
TargetCalpain small subunit 1/1 catalytic subunit
LigandBDBM50179741
Substrate/Competitorn/a
Meas. Tech.ChEMBL_340807 (CHEMBL867681)
IC50 75.9±n/a nM
Citation Auvin, SPignol, BNavet, ETroadec, MCarré, DCamara, JBigg, DChabrier, PE Novel dual inhibitors of calpain and lipid peroxidation with enhanced cellular activity. Bioorg Med Chem Lett16:1586-9 (2006) 
 
Calpain small subunit 1/1 catalytic subunit
Name:Calpain small subunit 1/1 catalytic subunit
Type:n/a
Mol. Mass.:n/a
Description:ASSAY_ID of EBI is 43671
Components:This complex has 2 components.
Component 1
Name:Calpain small subunit 1
Synonyms:CAPN4 CAPNS1 Calpain 1
Type:PROTEIN
Mol. Mass.:28309.36
Organism:Homo sapiens (Human)
Description:EBI_12682
Residue:268
Component 2
Name:Calpain-1 catalytic subunit
Synonyms:CAN1_HUMAN CAPN1 Calpain-1 (u-Calpain) Calpain1
Type:Protein
Mol. Mass.:81880.51
Organism:Homo sapiens (Human)
Description:n/a
Residue:714
BDBM50179741
NameBDBM50179741
Synonyms:(S)-2-((S)-2-(2-(10H-phenothiazin-2-yloxy)acetamido)-3-methylbutanamido)-N-((3S)-2-hydroxy-tetrahydrofuran-3-yl)-4-methylpentanamide | CHEMBL203570
TypeSmall organic molecule
Emp. Form.C29H38N4O6S
Mol. Mass.570.7
SMILESCC(C)C[C@H](NC(=O)[C@@H](NC(=O)COc1ccc2Sc3ccccc3Nc2c1)C(C)C)C(=O)N[C@H]1CCOC1O