Reaction Details
TargetPotassium voltage-gated channel subfamily H member 2
LigandBDBM50179774
Substrate/Competitorn/a
Meas. Tech.ChEMBL_336038 (CHEMBL865929)
Ki 1996±n/a nM
Citation Hollingworth, GJCarlson, EJCastro, JLChicchi, GGClark, NCooper, LCDirat, OSalvo, JDElliott, JMKilburn, RKurtz, MMRycroft, WTattersall, FDTsao, KLSwain, CJ Novel lactam NK1 antagonists with anti-emetic activity. Bioorg Med Chem Lett16:1197-201 (2006) 
 
Potassium voltage-gated channel subfamily H member 2
Name:Potassium voltage-gated channel subfamily H member 2
Type:Multi-pass membrane protein
Mol. Mass.:126672.65
Organism:Homo sapiens (Human)
Description:Q12809
Residue:1159
BDBM50179774
NameBDBM50179774
Synonyms:4-((1r,4r)-4-(3-(3,5-bis(trifluoromethyl)phenyl)-2-oxopyrrolidin-1-yl)-4-phenylcyclohexyl)-1-phenylpiperazin-2-one | CHEMBL203961
TypeSmall organic molecule
Emp. Form.C34H33F6N3O2
Mol. Mass.629.6351
SMILESFC(F)(F)c1cc(cc(c1)C(F)(F)F)C1CCN(C1=O)[C@]1(CC[C@@H](CC1)N1CCN(C(=O)C1)c1ccccc1)c1ccccc1