Reaction Details
TargetSubstance-P receptor
LigandBDBM50179768
Substrate/Competitorn/a
Meas. Tech.ChEMBL_336032 (CHEMBL867164)
IC50 0.33±n/a nM
Citation Hollingworth, GJCarlson, EJCastro, JLChicchi, GGClark, NCooper, LCDirat, OSalvo, JDElliott, JMKilburn, RKurtz, MMRycroft, WTattersall, FDTsao, KLSwain, CJ Novel lactam NK1 antagonists with anti-emetic activity. Bioorg Med Chem Lett16:1197-201 (2006) 
 
Substance-P receptor
Name:Substance-P receptor
Type:G Protein-Coupled Receptor (GPCR)
Mol. Mass.:46254.43
Organism:Homo sapiens (Human)
Description:P25103
Residue:407
BDBM50179768
NameBDBM50179768
Synonyms:3-(3,5-bis-trifluoromethyl-phenyl)-3-methyl-1-[4-(2-oxa-8-aza-spiro[4.5]dec-8-yl)-1-phenyl-cyclohexyl]-pyrrolidin-2-one | CHEMBL379224
TypeSmall organic molecule
Emp. Form.C33H38F6N2O2
Mol. Mass.608.6574
SMILESCC1(CCN(C1=O)[C@]1(CC[C@@H](CC1)N1CCC2(CCOC2)CC1)c1ccccc1)c1cc(cc(c1)C(F)(F)F)C(F)(F)F