Reaction Details
TargetSubstance-P receptor
LigandBDBM50179776
Substrate/Competitorn/a
Meas. Tech.ChEMBL_336032 (CHEMBL867164)
IC50 1.5±n/a nM
Citation Hollingworth, GJCarlson, EJCastro, JLChicchi, GGClark, NCooper, LCDirat, OSalvo, JDElliott, JMKilburn, RKurtz, MMRycroft, WTattersall, FDTsao, KLSwain, CJ Novel lactam NK1 antagonists with anti-emetic activity. Bioorg Med Chem Lett16:1197-201 (2006) 
 
Substance-P receptor
Name:Substance-P receptor
Type:G Protein-Coupled Receptor (GPCR)
Mol. Mass.:46254.43
Organism:Homo sapiens (Human)
Description:P25103
Residue:407
BDBM50179776
NameBDBM50179776
Synonyms:4-((1r,4r)-4-(3-(3,5-bis(trifluoromethyl)phenyl)-2-oxopiperidin-1-yl)-4-phenylcyclohexyl)-1-phenylpiperazin-2-one | CHEMBL380651
TypeSmall organic molecule
Emp. Form.C35H35F6N3O2
Mol. Mass.643.6617
SMILESFC(F)(F)c1cc(cc(c1)C(F)(F)F)C1CCCN(C1=O)[C@]1(CC[C@@H](CC1)N1CCN(C(=O)C1)c1ccccc1)c1ccccc1