Reaction Details
TargetPeroxisome proliferator-activated receptor alpha
LigandBDBM50179826
Substrate/Competitorn/a
Meas. Tech.ChEMBL_339274 (CHEMBL867227)
IC50 6±n/a nM
Citation Desai, RCMetzger, ESantini, CMeinke, PTHeck, JVBerger, JPMacNaul, KLCai, TQWright, SDAgrawal, AMoller, DESahoo, SP Design and synthesis of potent and subtype-selective PPARalpha agonists. Bioorg Med Chem Lett16:1673-8 (2006) 
 
Peroxisome proliferator-activated receptor alpha
Name:Peroxisome proliferator-activated receptor alpha
Type:Enzyme
Mol. Mass.:52222.08
Organism:Homo sapiens (Human)
Description:Q07869
Residue:468
BDBM50179826
NameBDBM50179826
Synonyms:(R)-2-(4-(3-(2-chloro-4-(4-fluorophenoxy)phenoxy)propoxy)benzyl)-2-methylbutanoic acid | CHEMBL203408
TypeSmall organic molecule
Emp. Form.C27H28ClFO5
Mol. Mass.486.96
SMILESCC[C@](C)(Cc1ccc(OCCCOc2ccc(Oc3ccc(F)cc3)cc2Cl)cc1)C(O)=O