Reaction Details
TargetPeroxisome proliferator-activated receptor alpha
LigandBDBM50179836
Substrate/Competitorn/a
Meas. Tech.ChEMBL_339274 (CHEMBL867227)
IC50 10±n/a nM
Citation Desai, RCMetzger, ESantini, CMeinke, PTHeck, JVBerger, JPMacNaul, KLCai, TQWright, SDAgrawal, AMoller, DESahoo, SP Design and synthesis of potent and subtype-selective PPARalpha agonists. Bioorg Med Chem Lett16:1673-8 (2006) 
 
Peroxisome proliferator-activated receptor alpha
Name:Peroxisome proliferator-activated receptor alpha
Type:Enzyme
Mol. Mass.:52222.08
Organism:Homo sapiens (Human)
Description:Q07869
Residue:468
BDBM50179836
NameBDBM50179836
Synonyms:(S)-2-(4-(3-(2-chloro-4-(2,2,2-trifluoroethoxy)phenoxy)propoxy)benzyl)-2-methylbutanoic acid | CHEMBL205803
TypeSmall organic molecule
Emp. Form.C23H26ClF3O5
Mol. Mass.474.898
SMILESCC[C@@](C)(Cc1ccc(OCCCOc2ccc(OCC(F)(F)F)cc2Cl)cc1)C(O)=O