Reaction Details
TargetGABA-A receptor; alpha-5/beta-3/gamma-2
LigandBDBM50179850
Substrate/Competitorn/a
Meas. Tech.ChEMBL_340784 (CHEMBL869461)
Ki 0.19±n/a nM
Citation Goodacre, SCHallett, DJCarling, RWCastro, JLReynolds, DSPike, AWafford, KANewman, RAtack, JRStreet, LJ Imidazo[1,2-a]pyrazin-8-ones, imidazo[1,2-d][1,2,4]triazin-8-ones and imidazo[2,1-f][1,2,4]triazin-8-ones as alpha2/alpha3 subtype selective GABA A agonists for the treatment of anxiety. Bioorg Med Chem Lett16:1582-5 (2006) 
 
GABA-A receptor; alpha-5/beta-3/gamma-2
Name:GABA-A receptor; alpha-5/beta-3/gamma-2
Type:n/a
Mol. Mass.:n/a
Description:ASSAY_ID of ChEMBL is 2148177
Components:This complex has 3 components.
Component 1
Name:Gamma-aminobutyric acid receptor subunit gamma-2
Synonyms:GABA(A) receptor subunit gamma-2 GBRG2_HUMAN
Type:PROTEIN
Mol. Mass.:54172.74
Organism:Homo sapiens (Human)
Description:EBI_217
Residue:467
Component 2
Name:Gamma-aminobutyric acid receptor subunit beta-3
Synonyms:GABA A receptor alpha-4/beta-3/gamma-2 GABA-A receptor GBRB3_HUMAN | agonist GABA site
Type:PROTEIN
Mol. Mass.:54130.51
Organism:Homo sapiens (Human)
Description:ChEMBL_448071
Residue:473
Component 3
Name:Gamma-aminobutyric acid receptor subunit alpha-5
Synonyms:GABA receptor alpha-5 subunit GABRA5 Gamma-aminobutyric acid receptor subunit alpha-5 (GABA(A)) | Gamma-aminobutyric acid receptor subunit alpha-5 (GABAA)
Type:Enzyme
Mol. Mass.:52160.59
Organism:Homo sapiens (Human)
Description:P31644
Residue:462
BDBM50179850
NameBDBM50179850
Synonyms:2',6-difluoro-5'-(7-methyl-8-oxo-7,8-dihydroimidazo[1,2-a]pyrazin-3-yl)-1,1'-biphenyl-2-carbonitrile | CHEMBL206380
TypeSmall organic molecule
Emp. Form.C20H12F2N4O
Mol. Mass.362.3323
SMILESCn1ccn2c(cnc2c1=O)-c1ccc(F)c(c1)-c1c(F)cccc1C#N